{"text_format":"1","workbook":"xlsx","n_sheets":4,"sheets":["Etape 1 - Categories","Etape 2 - Selection Indicateurs","Etape 3- Definition indicateurs","Step 4 - Seuils"],"not_rendered":{"charts":0,"images":0,"macros":1,"external_links":0,"defined_names":0,"comments":1,"pivot_tables":0},"unopened":[],"bounds":{"document_bytes":16777216,"sheet_cells":100000,"rows_first":2000,"rows_last":500,"rows_between":2000,"halvings":0,"cell_chars":16384,"cell_head_chars":4096},"cells_cut":0,"cells_raw":0,"read":"whole","date_system":"1900"}

{"sheet":"Etape 1 - Categories","index":0,"n_rows":7,"n_cols":4,"rows_kept":7,"cut":false,"hidden":false,"merged":[]}
[]
[]
[null,"Etape 1: Selectionner les categories"]
[]
[]
[null,"Nom de la catégorie",null,"Instructions"]
[null,null,null,"Renseigner la liste des catégories d'indicateurs à gauche"]

{"sheet":"Etape 2 - Selection Indicateurs","index":1,"n_rows":120,"n_cols":11,"rows_kept":120,"cut":false,"hidden":false,"merged":[[4,1,4,4],[2,1,3,4]]}
[null,null,null,null,null,"Key"]
[null,"Outil de sélection des indicateurs",null,null,null,"Indicateur de vagues futures","Inclure dans la carte de score pour la vague 1 "]
[null,"Étape 2 Instructions: ajoutez tous les indicateurs pertinents du (des) plan (s) stratégique (s) et des cadres de S&E à cette liste et envisagez leur inclusion dans la carte de score en fonction de leur priorité, de s'ils sont actionnables et de la disponibilité des données. Marquez en vert les indicateurs qui devraient apparaître dans la carte de score dans la vague 1. Marquez en rouge les indicateurs qui ne devraient pas être inclus dans la carte de score. Marquez en bleu les indicateurs à prendre en compte pour les vagues futures car les données ne sont pas actuellement disponibles. S'il y a des indicateurs pour lesquels plus de discussions sont nécessaires, vous pouvez les marquer en jaune. Bonnes pratiques: Sélectionnez 10 à 25 indicateurs sous nationaux pour la vague 1. \n***Si vous révisez les indicateurs d'une carte de score existante, ajoutez également les indicateurs qui figurent actuellement sur la carte à la liste, y compris les indicateurs de vague future, pour que les parties prenantes évaluent si des changements doivent être apportés aux indicateurs actuels.\t\t",null,null,null,"A revoir","Ne pas inclure dans la carte de score"]
[]
[]
[null,"Design Scorecard",{"$f":"IF('Etape 1 - Categories'!$B7=\"\",\"\",'Etape 1 - Categories'!$B7)","v":""},{"$f":"IF('Etape 1 - Categories'!$B8=\"\",\"\",'Etape 1 - Categories'!$B8)","v":""},{"$f":"IF('Etape 1 - Categories'!$B9=\"\",\"\",'Etape 1 - Categories'!$B9)","v":""},{"$f":"IF('Etape 1 - Categories'!$B10=\"\",\"\",'Etape 1 - Categories'!$B10)","v":""},{"$f":"IF('Etape 1 - Categories'!$B11=\"\",\"\",'Etape 1 - Categories'!$B11)","v":""},{"$f":"IF('Etape 1 - Categories'!$B13=\"\",\"\",'Etape 1 - Categories'!$B13)","v":""},{"$f":"IF('Etape 1 - Categories'!$B14=\"\",\"\",'Etape 1 - Categories'!$B14)","v":""},{"$f":"IF('Etape 1 - Categories'!$B15=\"\",\"\",'Etape 1 - Categories'!$B15)","v":""},{"$f":"IF('Etape 1 - Categories'!$B16=\"\",\"\",'Etape 1 - Categories'!$B16)","v":""}]
[null,{"$f":"#REF!","v":{"$error":"#REF!"}},{"$f":"IF(C$6=\"\",\"NA\",SUMPRODUCT(($D$11:$D$60=C$6)*(($E$11:$E$60=$B7)+($E$11:$E$60=#REF!))))","v":"NA"},{"$f":"IF(D$6=\"\",\"NA\",SUMPRODUCT(($D$11:$D$60=D$6)*(($E$11:$E$60=$B7)+($E$11:$E$60=#REF!))))","v":"NA"},{"$f":"IF(E$6=\"\",\"NA\",SUMPRODUCT(($D$11:$D$60=E$6)*(($E$11:$E$60=$B7)+($E$11:$E$60=#REF!))))","v":"NA"},{"$f":"IF(F$6=\"\",\"NA\",SUMPRODUCT(($D$11:$D$60=F$6)*(($E$11:$E$60=$B7)+($E$11:$E$60=#REF!))))","v":"NA"},{"$f":"IF(G$6=\"\",\"NA\",SUMPRODUCT(($D$11:$D$60=G$6)*(($E$11:$E$60=$B7)+($E$11:$E$60=#REF!))))","v":"NA"},{"$f":"IF(H$6=\"\",\"NA\",SUMPRODUCT(($D$11:$D$60=H$6)*(($E$11:$E$60=$B7)+($E$11:$E$60=#REF!))))","v":"NA"},{"$f":"IF(I$6=\"\",\"NA\",SUMPRODUCT(($D$11:$D$60=I$6)*(($E$11:$E$60=$B7)+($E$11:$E$60=#REF!))))","v":"NA"},{"$f":"IF(J$6=\"\",\"NA\",SUMPRODUCT(($D$11:$D$60=J$6)*(($E$11:$E$60=$B7)+($E$11:$E$60=#REF!))))","v":"NA"},{"$f":"IF(K$6=\"\",\"NA\",SUMPRODUCT(($D$11:$D$60=K$6)*(($E$11:$E$60=$B7)+($E$11:$E$60=#REF!))))","v":"NA"}]
[null,{"$f":"#REF!","v":{"$error":"#REF!"}},{"$f":"IF(C$6=\"\",\"NA\",SUMPRODUCT(($D$11:$D$60=C$6)*(($E$11:$E$60=$B8)+($E$11:$E$60=#REF!))))","v":"NA"},{"$f":"IF(D$6=\"\",\"NA\",SUMPRODUCT(($D$11:$D$60=D$6)*(($E$11:$E$60=$B8)+($E$11:$E$60=#REF!))))","v":"NA"},{"$f":"IF(E$6=\"\",\"NA\",SUMPRODUCT(($D$11:$D$60=E$6)*(($E$11:$E$60=$B8)+($E$11:$E$60=#REF!))))","v":"NA"},{"$f":"IF(F$6=\"\",\"NA\",SUMPRODUCT(($D$11:$D$60=F$6)*(($E$11:$E$60=$B8)+($E$11:$E$60=#REF!))))","v":"NA"},{"$f":"IF(G$6=\"\",\"NA\",SUMPRODUCT(($D$11:$D$60=G$6)*(($E$11:$E$60=$B8)+($E$11:$E$60=#REF!))))","v":"NA"},{"$f":"IF(H$6=\"\",\"NA\",SUMPRODUCT(($D$11:$D$60=H$6)*(($E$11:$E$60=$B8)+($E$11:$E$60=#REF!))))","v":"NA"},{"$f":"IF(I$6=\"\",\"NA\",SUMPRODUCT(($D$11:$D$60=I$6)*(($E$11:$E$60=$B8)+($E$11:$E$60=#REF!))))","v":"NA"},{"$f":"IF(J$6=\"\",\"NA\",SUMPRODUCT(($D$11:$D$60=J$6)*(($E$11:$E$60=$B8)+($E$11:$E$60=#REF!))))","v":"NA"},{"$f":"IF(K$6=\"\",\"NA\",SUMPRODUCT(($D$11:$D$60=K$6)*(($E$11:$E$60=$B8)+($E$11:$E$60=#REF!))))","v":"NA"}]
[]
[null,"#","Nom de l'indicateur: \nQuel est le nom de l'indicateur tel qu'il apparaît dans le SNIS (DHIS2) et les plans stratégiques et de suivi et evaluation?","Categorie\nÀ quelle catégorie de la carte de score l'indicateur appartient-il? Sélectionnez l'une des catégories identifiées à l'étape 1","National / Sous-national\nSouhaitez-vous que l'indicateur apparaisse au niveau national ou au niveau sous-national dans la carte de score? Si vous sélectionnez national, une seule valeur de données apparaîtra pour l'ensemble du pays. Si vous sélectionnez le niveau sous national, des données seront affichées pour chaque région, district etc.","Frequence\nÀ quelle fréquence l'indicateur sera-t-il mis à jour dans la carte de score? Si votre carte de score est trimestrielle, et que les données sont de routine, écrivez 'trimestriel'.","Vague\nVague 1 = les données sont disponibles aujourd'hui\nVague 2 = les données seront disponibles à court terme (6-12 mois)\nVague 3 = les données ne seront disponibles qu'à long terme"]
[null,1]
[null,2]
[null,3]
[null,4]
[null,5]
[null,6]
[null,7]
[null,8]
[null,9]
[null,10]
[null,11]
[null,12]
[null,13]
[null,14]
[null,15]
[null,16]
[null,17]
[null,18]
[null,19]
[null,20]
[null,21]
[null,22]
[null,23]
[null,24]
[null,25]
[null,26]
[null,27]
[null,28]
[null,29]
[null,30]
{"$rows_left_out":81}
{"sheet":"Etape 3- Definition indicateurs","index":2,"n_rows":120,"n_cols":7,"rows_kept":120,"cut":false,"hidden":false,"merged":[[2,1,2,6]]}
[]
[null,"Definitions des indicateurs"]
[null,"Étape 3 Instructions: copiez et collez dans cette feuille la liste des indicateurs verts de la vague 1 de l'étape 2. Pour chaque indicateur, ajoutez le numérateur, le dénominateur et la source de données. Ces définitions devraient provenir de documents de référence existants tels que le cadre national de S&E."]
[]
[]
[null,"Nom de l'indicateur","Category","National / Subnational","Numerateur","Denominateur","Source de données"]
[1,{"$f":"IF('Etape 2 - Selection Indicateurs'!C11=\"\",\"\",'Etape 2 - Selection Indicateurs'!C11)","v":""},{"$f":"IF('Etape 2 - Selection Indicateurs'!D11=\"\",\"\",'Etape 2 - Selection Indicateurs'!D11)","v":""},{"$f":"IF('Etape 2 - Selection Indicateurs'!E11=\"\",\"\",'Etape 2 - Selection Indicateurs'!E11)","v":""}]
[2,{"$f":"IF('Etape 2 - Selection Indicateurs'!C12=\"\",\"\",'Etape 2 - Selection Indicateurs'!C12)","v":""},{"$f":"IF('Etape 2 - Selection Indicateurs'!D12=\"\",\"\",'Etape 2 - Selection Indicateurs'!D12)","v":""},{"$f":"IF('Etape 2 - Selection Indicateurs'!E12=\"\",\"\",'Etape 2 - Selection Indicateurs'!E12)","v":""}]
[3,{"$f":"IF('Etape 2 - Selection Indicateurs'!C13=\"\",\"\",'Etape 2 - Selection Indicateurs'!C13)","v":""},{"$f":"IF('Etape 2 - Selection Indicateurs'!D13=\"\",\"\",'Etape 2 - Selection Indicateurs'!D13)","v":""},{"$f":"IF('Etape 2 - Selection Indicateurs'!E13=\"\",\"\",'Etape 2 - Selection Indicateurs'!E13)","v":""}]
[4,{"$f":"IF('Etape 2 - Selection Indicateurs'!C14=\"\",\"\",'Etape 2 - Selection Indicateurs'!C14)","v":""},{"$f":"IF('Etape 2 - Selection Indicateurs'!D14=\"\",\"\",'Etape 2 - Selection Indicateurs'!D14)","v":""},{"$f":"IF('Etape 2 - Selection Indicateurs'!E14=\"\",\"\",'Etape 2 - Selection Indicateurs'!E14)","v":""}]
[5,{"$f":"IF('Etape 2 - Selection Indicateurs'!C15=\"\",\"\",'Etape 2 - Selection Indicateurs'!C15)","v":""},{"$f":"IF('Etape 2 - Selection Indicateurs'!D15=\"\",\"\",'Etape 2 - Selection Indicateurs'!D15)","v":""},{"$f":"IF('Etape 2 - Selection Indicateurs'!E15=\"\",\"\",'Etape 2 - Selection Indicateurs'!E15)","v":""}]
[6,{"$f":"IF('Etape 2 - Selection Indicateurs'!C16=\"\",\"\",'Etape 2 - Selection Indicateurs'!C16)","v":""},{"$f":"IF('Etape 2 - Selection Indicateurs'!D16=\"\",\"\",'Etape 2 - Selection Indicateurs'!D16)","v":""},{"$f":"IF('Etape 2 - Selection Indicateurs'!E16=\"\",\"\",'Etape 2 - Selection Indicateurs'!E16)","v":""}]
[7,{"$f":"IF('Etape 2 - Selection Indicateurs'!C17=\"\",\"\",'Etape 2 - Selection Indicateurs'!C17)","v":""},{"$f":"IF('Etape 2 - Selection Indicateurs'!D17=\"\",\"\",'Etape 2 - Selection Indicateurs'!D17)","v":""},{"$f":"IF('Etape 2 - Selection Indicateurs'!E17=\"\",\"\",'Etape 2 - Selection Indicateurs'!E17)","v":""}]
[8,{"$f":"IF('Etape 2 - Selection Indicateurs'!C18=\"\",\"\",'Etape 2 - Selection Indicateurs'!C18)","v":""},{"$f":"IF('Etape 2 - Selection Indicateurs'!D18=\"\",\"\",'Etape 2 - Selection Indicateurs'!D18)","v":""},{"$f":"IF('Etape 2 - Selection Indicateurs'!E18=\"\",\"\",'Etape 2 - Selection Indicateurs'!E18)","v":""}]
[9,{"$f":"IF('Etape 2 - Selection Indicateurs'!C19=\"\",\"\",'Etape 2 - Selection Indicateurs'!C19)","v":""},{"$f":"IF('Etape 2 - Selection Indicateurs'!D19=\"\",\"\",'Etape 2 - Selection Indicateurs'!D19)","v":""},{"$f":"IF('Etape 2 - Selection Indicateurs'!E19=\"\",\"\",'Etape 2 - Selection Indicateurs'!E19)","v":""}]
[10,{"$f":"IF('Etape 2 - Selection Indicateurs'!C20=\"\",\"\",'Etape 2 - Selection Indicateurs'!C20)","v":""},{"$f":"IF('Etape 2 - Selection Indicateurs'!D20=\"\",\"\",'Etape 2 - Selection Indicateurs'!D20)","v":""},{"$f":"IF('Etape 2 - Selection Indicateurs'!E20=\"\",\"\",'Etape 2 - Selection Indicateurs'!E20)","v":""}]
[11,{"$f":"IF('Etape 2 - Selection Indicateurs'!C21=\"\",\"\",'Etape 2 - Selection Indicateurs'!C21)","v":""},{"$f":"IF('Etape 2 - Selection Indicateurs'!D21=\"\",\"\",'Etape 2 - Selection Indicateurs'!D21)","v":""},{"$f":"IF('Etape 2 - Selection Indicateurs'!E21=\"\",\"\",'Etape 2 - Selection Indicateurs'!E21)","v":""}]
[12,{"$f":"IF('Etape 2 - Selection Indicateurs'!C22=\"\",\"\",'Etape 2 - Selection Indicateurs'!C22)","v":""},{"$f":"IF('Etape 2 - Selection Indicateurs'!D22=\"\",\"\",'Etape 2 - Selection Indicateurs'!D22)","v":""},{"$f":"IF('Etape 2 - Selection Indicateurs'!E22=\"\",\"\",'Etape 2 - Selection Indicateurs'!E22)","v":""}]
[13,{"$f":"IF('Etape 2 - Selection Indicateurs'!C23=\"\",\"\",'Etape 2 - Selection Indicateurs'!C23)","v":""},{"$f":"IF('Etape 2 - Selection Indicateurs'!D23=\"\",\"\",'Etape 2 - Selection Indicateurs'!D23)","v":""},{"$f":"IF('Etape 2 - Selection Indicateurs'!E23=\"\",\"\",'Etape 2 - Selection Indicateurs'!E23)","v":""}]
[14,{"$f":"IF('Etape 2 - Selection Indicateurs'!C24=\"\",\"\",'Etape 2 - Selection Indicateurs'!C24)","v":""},{"$f":"IF('Etape 2 - Selection Indicateurs'!D24=\"\",\"\",'Etape 2 - Selection Indicateurs'!D24)","v":""},{"$f":"IF('Etape 2 - Selection Indicateurs'!E24=\"\",\"\",'Etape 2 - Selection Indicateurs'!E24)","v":""}]
[15,{"$f":"IF('Etape 2 - Selection Indicateurs'!C25=\"\",\"\",'Etape 2 - Selection Indicateurs'!C25)","v":""},{"$f":"IF('Etape 2 - Selection Indicateurs'!D25=\"\",\"\",'Etape 2 - Selection Indicateurs'!D25)","v":""},{"$f":"IF('Etape 2 - Selection Indicateurs'!E25=\"\",\"\",'Etape 2 - Selection Indicateurs'!E25)","v":""}]
[16,{"$f":"IF('Etape 2 - Selection Indicateurs'!C26=\"\",\"\",'Etape 2 - Selection Indicateurs'!C26)","v":""},{"$f":"IF('Etape 2 - Selection Indicateurs'!D26=\"\",\"\",'Etape 2 - Selection Indicateurs'!D26)","v":""},{"$f":"IF('Etape 2 - Selection Indicateurs'!E26=\"\",\"\",'Etape 2 - Selection Indicateurs'!E26)","v":""}]
[17,{"$f":"IF('Etape 2 - Selection Indicateurs'!C27=\"\",\"\",'Etape 2 - Selection Indicateurs'!C27)","v":""},{"$f":"IF('Etape 2 - Selection Indicateurs'!D27=\"\",\"\",'Etape 2 - Selection Indicateurs'!D27)","v":""},{"$f":"IF('Etape 2 - Selection Indicateurs'!E27=\"\",\"\",'Etape 2 - Selection Indicateurs'!E27)","v":""}]
[18,{"$f":"IF('Etape 2 - Selection Indicateurs'!C28=\"\",\"\",'Etape 2 - Selection Indicateurs'!C28)","v":""},{"$f":"IF('Etape 2 - Selection Indicateurs'!D28=\"\",\"\",'Etape 2 - Selection Indicateurs'!D28)","v":""},{"$f":"IF('Etape 2 - Selection Indicateurs'!E28=\"\",\"\",'Etape 2 - Selection Indicateurs'!E28)","v":""}]
[19,{"$f":"IF('Etape 2 - Selection Indicateurs'!C29=\"\",\"\",'Etape 2 - Selection Indicateurs'!C29)","v":""},{"$f":"IF('Etape 2 - Selection Indicateurs'!D29=\"\",\"\",'Etape 2 - Selection Indicateurs'!D29)","v":""},{"$f":"IF('Etape 2 - Selection Indicateurs'!E29=\"\",\"\",'Etape 2 - Selection Indicateurs'!E29)","v":""}]
[20,{"$f":"IF('Etape 2 - Selection Indicateurs'!C30=\"\",\"\",'Etape 2 - Selection Indicateurs'!C30)","v":""},{"$f":"IF('Etape 2 - Selection Indicateurs'!D30=\"\",\"\",'Etape 2 - Selection Indicateurs'!D30)","v":""},{"$f":"IF('Etape 2 - Selection Indicateurs'!E30=\"\",\"\",'Etape 2 - Selection Indicateurs'!E30)","v":""}]
[21,{"$f":"IF('Etape 2 - Selection Indicateurs'!C31=\"\",\"\",'Etape 2 - Selection Indicateurs'!C31)","v":""},{"$f":"IF('Etape 2 - Selection Indicateurs'!D31=\"\",\"\",'Etape 2 - Selection Indicateurs'!D31)","v":""},{"$f":"IF('Etape 2 - Selection Indicateurs'!E31=\"\",\"\",'Etape 2 - Selection Indicateurs'!E31)","v":""}]
[22,{"$f":"IF('Etape 2 - Selection Indicateurs'!C32=\"\",\"\",'Etape 2 - Selection Indicateurs'!C32)","v":""},{"$f":"IF('Etape 2 - Selection Indicateurs'!D32=\"\",\"\",'Etape 2 - Selection Indicateurs'!D32)","v":""},{"$f":"IF('Etape 2 - Selection Indicateurs'!E32=\"\",\"\",'Etape 2 - Selection Indicateurs'!E32)","v":""}]
[23,{"$f":"IF('Etape 2 - Selection Indicateurs'!C33=\"\",\"\",'Etape 2 - Selection Indicateurs'!C33)","v":""},{"$f":"IF('Etape 2 - Selection Indicateurs'!D33=\"\",\"\",'Etape 2 - Selection Indicateurs'!D33)","v":""},{"$f":"IF('Etape 2 - Selection Indicateurs'!E33=\"\",\"\",'Etape 2 - Selection Indicateurs'!E33)","v":""}]
[24,{"$f":"IF('Etape 2 - Selection Indicateurs'!C34=\"\",\"\",'Etape 2 - Selection Indicateurs'!C34)","v":""},{"$f":"IF('Etape 2 - Selection Indicateurs'!D34=\"\",\"\",'Etape 2 - Selection Indicateurs'!D34)","v":""},{"$f":"IF('Etape 2 - Selection Indicateurs'!E34=\"\",\"\",'Etape 2 - Selection Indicateurs'!E34)","v":""}]
[25,{"$f":"IF('Etape 2 - Selection Indicateurs'!C35=\"\",\"\",'Etape 2 - Selection Indicateurs'!C35)","v":""},{"$f":"IF('Etape 2 - Selection Indicateurs'!D35=\"\",\"\",'Etape 2 - Selection Indicateurs'!D35)","v":""},{"$f":"IF('Etape 2 - Selection Indicateurs'!E35=\"\",\"\",'Etape 2 - Selection Indicateurs'!E35)","v":""}]
[null,{"$f":"IF('Etape 2 - Selection Indicateurs'!C36=\"\",\"\",'Etape 2 - Selection Indicateurs'!C36)","v":""},{"$f":"IF('Etape 2 - Selection Indicateurs'!D36=\"\",\"\",'Etape 2 - Selection Indicateurs'!D36)","v":""},{"$f":"IF('Etape 2 - Selection Indicateurs'!E36=\"\",\"\",'Etape 2 - Selection Indicateurs'!E36)","v":""}]
[null,{"$f":"IF('Etape 2 - Selection Indicateurs'!C37=\"\",\"\",'Etape 2 - Selection Indicateurs'!C37)","v":""},{"$f":"IF('Etape 2 - Selection Indicateurs'!D37=\"\",\"\",'Etape 2 - Selection Indicateurs'!D37)","v":""},{"$f":"IF('Etape 2 - Selection Indicateurs'!E37=\"\",\"\",'Etape 2 - Selection Indicateurs'!E37)","v":""}]
[null,{"$f":"IF('Etape 2 - Selection Indicateurs'!C38=\"\",\"\",'Etape 2 - Selection Indicateurs'!C38)","v":""},{"$f":"IF('Etape 2 - Selection Indicateurs'!D38=\"\",\"\",'Etape 2 - Selection Indicateurs'!D38)","v":""},{"$f":"IF('Etape 2 - Selection Indicateurs'!E38=\"\",\"\",'Etape 2 - Selection Indicateurs'!E38)","v":""}]
[null,{"$f":"IF('Etape 2 - Selection Indicateurs'!C39=\"\",\"\",'Etape 2 - Selection Indicateurs'!C39)","v":""},{"$f":"IF('Etape 2 - Selection Indicateurs'!D39=\"\",\"\",'Etape 2 - Selection Indicateurs'!D39)","v":""},{"$f":"IF('Etape 2 - Selection Indicateurs'!E39=\"\",\"\",'Etape 2 - Selection Indicateurs'!E39)","v":""}]
[null,{"$f":"IF('Etape 2 - Selection Indicateurs'!C40=\"\",\"\",'Etape 2 - Selection Indicateurs'!C40)","v":""},{"$f":"IF('Etape 2 - Selection Indicateurs'!D40=\"\",\"\",'Etape 2 - Selection Indicateurs'!D40)","v":""},{"$f":"IF('Etape 2 - Selection Indicateurs'!E40=\"\",\"\",'Etape 2 - Selection Indicateurs'!E40)","v":""}]
[null,{"$f":"IF('Etape 2 - Selection Indicateurs'!C41=\"\",\"\",'Etape 2 - Selection Indicateurs'!C41)","v":""},{"$f":"IF('Etape 2 - Selection Indicateurs'!D41=\"\",\"\",'Etape 2 - Selection Indicateurs'!D41)","v":""},{"$f":"IF('Etape 2 - Selection Indicateurs'!E41=\"\",\"\",'Etape 2 - Selection Indicateurs'!E41)","v":""}]
[null,{"$f":"IF('Etape 2 - Selection Indicateurs'!C42=\"\",\"\",'Etape 2 - Selection Indicateurs'!C42)","v":""},{"$f":"IF('Etape 2 - Selection Indicateurs'!D42=\"\",\"\",'Etape 2 - Selection Indicateurs'!D42)","v":""},{"$f":"IF('Etape 2 - Selection Indicateurs'!E42=\"\",\"\",'Etape 2 - Selection Indicateurs'!E42)","v":""}]
[null,{"$f":"IF('Etape 2 - Selection Indicateurs'!C43=\"\",\"\",'Etape 2 - Selection Indicateurs'!C43)","v":""},{"$f":"IF('Etape 2 - Selection Indicateurs'!D43=\"\",\"\",'Etape 2 - Selection Indicateurs'!D43)","v":""},{"$f":"IF('Etape 2 - Selection Indicateurs'!E43=\"\",\"\",'Etape 2 - Selection Indicateurs'!E43)","v":""}]
[null,{"$f":"IF('Etape 2 - Selection Indicateurs'!C44=\"\",\"\",'Etape 2 - Selection Indicateurs'!C44)","v":""},{"$f":"IF('Etape 2 - Selection Indicateurs'!D44=\"\",\"\",'Etape 2 - Selection Indicateurs'!D44)","v":""},{"$f":"IF('Etape 2 - Selection Indicateurs'!E44=\"\",\"\",'Etape 2 - Selection Indicateurs'!E44)","v":""}]
{"$rows_left_out":81}
{"sheet":"Step 4 - Seuils","index":3,"n_rows":145,"n_cols":5,"rows_kept":145,"cut":false,"hidden":false,"merged":[[2,1,2,4],[3,1,3,4]]}
[]
[null,"Définir les seuils de couleur et de flèche"]
[null,"Étape 4 Instructions: Copiez et collez dans cette feuille la liste des indicateurs de la vague verte 1 de l'étape 2. Pour chaque indicateur, écrivez la valeur à laquelle la couleur doit passer au rouge ET la valeur à laquelle la couleur doit passer au vert. Il n'est pas nécessaire d'inclure le jaune, car il se situera entre les valeurs définies pour le rouge et le vert. Par exemple, si le seuil rouge est de 80% et le vert est de 90%, alors toute valeur de données inférieure à 80% sera rouge et toute valeur supérieure à 90% sera verte. Habituellement, les pays alignent le seuil vert sur l'objectif de la dernière année du plan stratégique et le rouge comme référence."]
[null,"Pour les seuils de flèches, indiquez le changement nécessaire pour qu'une flèche apparaisse dans la carte de performance. Par exemple, si vous écrivez 5% pour le seuil de flèche, une flèche n'apparaîtra que si la valeur des données a augmenté ou diminué d'au moins 5% par rapport à la période ou à l'année précédente. Les flèches indiquent si les performances se sont améliorées ou dégradées. Bonnes pratiques à considérer: des changements de quelques pourcents sont parfois negligeables, considérez combien de changements seraient nécessaires pour qu'il y ait une amélioration significative de l'indicateur."]
[]
["#","Nom de l'indicateur","Seuil rouge","Seuil vert","Seuil de la flêche"]
[1,{"$f":"IF('Etape 2 - Selection Indicateurs'!C11=\"\",\"\",'Etape 2 - Selection Indicateurs'!C11)","v":""}]
[2,{"$f":"IF('Etape 2 - Selection Indicateurs'!C12=\"\",\"\",'Etape 2 - Selection Indicateurs'!C12)","v":""}]
[3,{"$f":"IF('Etape 2 - Selection Indicateurs'!C13=\"\",\"\",'Etape 2 - Selection Indicateurs'!C13)","v":""}]
[4,{"$f":"IF('Etape 2 - Selection Indicateurs'!C14=\"\",\"\",'Etape 2 - Selection Indicateurs'!C14)","v":""}]
[5,{"$f":"IF('Etape 2 - Selection Indicateurs'!C15=\"\",\"\",'Etape 2 - Selection Indicateurs'!C15)","v":""}]
[6,{"$f":"IF('Etape 2 - Selection Indicateurs'!C16=\"\",\"\",'Etape 2 - Selection Indicateurs'!C16)","v":""}]
[7,{"$f":"IF('Etape 2 - Selection Indicateurs'!C17=\"\",\"\",'Etape 2 - Selection Indicateurs'!C17)","v":""}]
[8,{"$f":"IF('Etape 2 - Selection Indicateurs'!C18=\"\",\"\",'Etape 2 - Selection Indicateurs'!C18)","v":""}]
[9,{"$f":"IF('Etape 2 - Selection Indicateurs'!C19=\"\",\"\",'Etape 2 - Selection Indicateurs'!C19)","v":""}]
[10,{"$f":"IF('Etape 2 - Selection Indicateurs'!C20=\"\",\"\",'Etape 2 - Selection Indicateurs'!C20)","v":""}]
[11,{"$f":"IF('Etape 2 - Selection Indicateurs'!C21=\"\",\"\",'Etape 2 - Selection Indicateurs'!C21)","v":""}]
[12,{"$f":"IF('Etape 2 - Selection Indicateurs'!C22=\"\",\"\",'Etape 2 - Selection Indicateurs'!C22)","v":""}]
[13,{"$f":"IF('Etape 2 - Selection Indicateurs'!C23=\"\",\"\",'Etape 2 - Selection Indicateurs'!C23)","v":""}]
[14,{"$f":"IF('Etape 2 - Selection Indicateurs'!C24=\"\",\"\",'Etape 2 - Selection Indicateurs'!C24)","v":""}]
[15,{"$f":"IF('Etape 2 - Selection Indicateurs'!C25=\"\",\"\",'Etape 2 - Selection Indicateurs'!C25)","v":""}]
[16,{"$f":"IF('Etape 2 - Selection Indicateurs'!C26=\"\",\"\",'Etape 2 - Selection Indicateurs'!C26)","v":""}]
[17,{"$f":"IF('Etape 2 - Selection Indicateurs'!C27=\"\",\"\",'Etape 2 - Selection Indicateurs'!C27)","v":""}]
[18,{"$f":"IF('Etape 2 - Selection Indicateurs'!C28=\"\",\"\",'Etape 2 - Selection Indicateurs'!C28)","v":""}]
[19,{"$f":"IF('Etape 2 - Selection Indicateurs'!C29=\"\",\"\",'Etape 2 - Selection Indicateurs'!C29)","v":""}]
[20,{"$f":"IF('Etape 2 - Selection Indicateurs'!C30=\"\",\"\",'Etape 2 - Selection Indicateurs'!C30)","v":""}]
[21,{"$f":"IF('Etape 2 - Selection Indicateurs'!C31=\"\",\"\",'Etape 2 - Selection Indicateurs'!C31)","v":""}]
[22,{"$f":"IF('Etape 2 - Selection Indicateurs'!C32=\"\",\"\",'Etape 2 - Selection Indicateurs'!C32)","v":""}]
[23,{"$f":"IF('Etape 2 - Selection Indicateurs'!C33=\"\",\"\",'Etape 2 - Selection Indicateurs'!C33)","v":""}]
[24,{"$f":"IF('Etape 2 - Selection Indicateurs'!C34=\"\",\"\",'Etape 2 - Selection Indicateurs'!C34)","v":""}]
[25,{"$f":"IF('Etape 2 - Selection Indicateurs'!C35=\"\",\"\",'Etape 2 - Selection Indicateurs'!C35)","v":""}]
[26,{"$f":"IF('Etape 2 - Selection Indicateurs'!C36=\"\",\"\",'Etape 2 - Selection Indicateurs'!C36)","v":""}]
[27,{"$f":"IF('Etape 2 - Selection Indicateurs'!C37=\"\",\"\",'Etape 2 - Selection Indicateurs'!C37)","v":""}]
[28,{"$f":"IF('Etape 2 - Selection Indicateurs'!C38=\"\",\"\",'Etape 2 - Selection Indicateurs'!C38)","v":""}]
[29,{"$f":"IF('Etape 2 - Selection Indicateurs'!C39=\"\",\"\",'Etape 2 - Selection Indicateurs'!C39)","v":""}]
[30,{"$f":"IF('Etape 2 - Selection Indicateurs'!C40=\"\",\"\",'Etape 2 - Selection Indicateurs'!C40)","v":""}]
[31,{"$f":"IF('Etape 2 - Selection Indicateurs'!C41=\"\",\"\",'Etape 2 - Selection Indicateurs'!C41)","v":""}]
[32,{"$f":"IF('Etape 2 - Selection Indicateurs'!C42=\"\",\"\",'Etape 2 - Selection Indicateurs'!C42)","v":""}]
[33,{"$f":"IF('Etape 2 - Selection Indicateurs'!C43=\"\",\"\",'Etape 2 - Selection Indicateurs'!C43)","v":""}]
[34,{"$f":"IF('Etape 2 - Selection Indicateurs'!C44=\"\",\"\",'Etape 2 - Selection Indicateurs'!C44)","v":""}]
{"$rows_left_out":105}