{"text_format":"1","workbook":"xlsx","n_sheets":6,"sheets":["Step 0 - Configuration","Étape 1 - Sélection categories","Étape 2 - Sélection indicateurs","Étape 3 - Définir indicateurs","Step 4 - Set Thresholds","Output - Draft Scorecard"],"not_rendered":{"charts":0,"images":0,"macros":1,"external_links":0,"defined_names":0,"comments":0,"pivot_tables":2},"unopened":[],"bounds":{"document_bytes":16777216,"sheet_cells":100000,"rows_first":2000,"rows_last":500,"rows_between":2000,"halvings":0,"cell_chars":16384,"cell_head_chars":4096},"cells_cut":0,"cells_raw":0,"read":"whole","date_system":"1900"}

{"sheet":"Step 0 - Configuration","index":0,"n_rows":6,"n_cols":5,"rows_kept":6,"cut":false,"hidden":false,"merged":[]}
[]
[]
[null,"Nom du pays","NOM DU PAYS",null,"National / Sous-national"]
[null,null,null,null,"National"]
[null,null,null,null,"Sous-national"]
[null,"Nom de la carte de score","NOM DE LA CARTE DE SCORE"]

{"sheet":"Étape 1 - Sélection categories","index":1,"n_rows":7,"n_cols":4,"rows_kept":7,"cut":false,"hidden":false,"merged":[]}
[]
[null,{"$f":"CONCATENATE('Step 0 - Configuration'!C3,\": \",'Step 0 - Configuration'!C6)","v":"NOM DU PAYS: NOM DE LA CARTE DE SCORE"}]
[null,"Étape 1: Sélection des catégories"]
[]
[]
[null,"Nom de la catégorie",null,"Instructions"]
[null,null,null,"Entrez la liste des catégories d'indicateurs dans la liste à gauche"]

{"sheet":"Étape 2 - Sélection indicateurs","index":2,"n_rows":120,"n_cols":12,"rows_kept":120,"cut":false,"hidden":false,"merged":[]}
[]
[null,null,null,null,"Légende"]
[null,{"$f":"CONCATENATE('Step 0 - Configuration'!C3,\": \",'Step 0 - Configuration'!C6)","v":"NOM DU PAYS: NOM DE LA CARTE DE SCORE"},null,null,"Indicateur pour le vague future","garder"]
[null,"Étape 2: Sélection des indicateurs",null,null,"A vérifier","retirer de la carte de score"]
[]
[null,"Design Scorecard",{"$f":"IF('Étape 1 - Sélection categories'!$B7=\"\",\"\",'Étape 1 - Sélection categories'!$B7)","v":""},{"$f":"IF('Étape 1 - Sélection categories'!$B8=\"\",\"\",'Étape 1 - Sélection categories'!$B8)","v":""},{"$f":"IF('Étape 1 - Sélection categories'!$B9=\"\",\"\",'Étape 1 - Sélection categories'!$B9)","v":""},{"$f":"IF('Étape 1 - Sélection categories'!$B10=\"\",\"\",'Étape 1 - Sélection categories'!$B10)","v":""},{"$f":"IF('Étape 1 - Sélection categories'!$B11=\"\",\"\",'Étape 1 - Sélection categories'!$B11)","v":""},{"$f":"IF('Étape 1 - Sélection categories'!$B12=\"\",\"\",'Étape 1 - Sélection categories'!$B12)","v":""},{"$f":"IF('Étape 1 - Sélection categories'!$B13=\"\",\"\",'Étape 1 - Sélection categories'!$B13)","v":""},{"$f":"IF('Étape 1 - Sélection categories'!$B14=\"\",\"\",'Étape 1 - Sélection categories'!$B14)","v":""},{"$f":"IF('Étape 1 - Sélection categories'!$B15=\"\",\"\",'Étape 1 - Sélection categories'!$B15)","v":""},{"$f":"IF('Étape 1 - Sélection categories'!$B16=\"\",\"\",'Étape 1 - Sélection categories'!$B16)","v":""}]
[null,{"$f":"'Step 0 - Configuration'!E4","v":"National"},{"$f":"IF(C$6=\"\",\"NA\",SUMPRODUCT(($D$11:$D$60=C$6)*(($E$11:$E$60=$B7)+($E$11:$E$60='Step 0 - Configuration'!#REF!))))","v":"NA"},{"$f":"IF(D$6=\"\",\"NA\",SUMPRODUCT(($D$11:$D$60=D$6)*(($E$11:$E$60=$B7)+($E$11:$E$60='Step 0 - Configuration'!#REF!))))","v":"NA"},{"$f":"IF(E$6=\"\",\"NA\",SUMPRODUCT(($D$11:$D$60=E$6)*(($E$11:$E$60=$B7)+($E$11:$E$60='Step 0 - Configuration'!#REF!))))","v":"NA"},{"$f":"IF(F$6=\"\",\"NA\",SUMPRODUCT(($D$11:$D$60=F$6)*(($E$11:$E$60=$B7)+($E$11:$E$60='Step 0 - Configuration'!#REF!))))","v":"NA"},{"$f":"IF(G$6=\"\",\"NA\",SUMPRODUCT(($D$11:$D$60=G$6)*(($E$11:$E$60=$B7)+($E$11:$E$60='Step 0 - Configuration'!#REF!))))","v":"NA"},{"$f":"IF(H$6=\"\",\"NA\",SUMPRODUCT(($D$11:$D$60=H$6)*(($E$11:$E$60=$B7)+($E$11:$E$60='Step 0 - Configuration'!#REF!))))","v":"NA"},{"$f":"IF(I$6=\"\",\"NA\",SUMPRODUCT(($D$11:$D$60=I$6)*(($E$11:$E$60=$B7)+($E$11:$E$60='Step 0 - Configuration'!#REF!))))","v":"NA"},{"$f":"IF(J$6=\"\",\"NA\",SUMPRODUCT(($D$11:$D$60=J$6)*(($E$11:$E$60=$B7)+($E$11:$E$60='Step 0 - Configuration'!#REF!))))","v":"NA"},{"$f":"IF(K$6=\"\",\"NA\",SUMPRODUCT(($D$11:$D$60=K$6)*(($E$11:$E$60=$B7)+($E$11:$E$60='Step 0 - Configuration'!#REF!))))","v":"NA"},{"$f":"IF(L$6=\"\",\"NA\",SUMPRODUCT(($D$11:$D$60=L$6)*(($E$11:$E$60=$B7)+($E$11:$E$60='Step 0 - Configuration'!#REF!))))","v":"NA"}]
[null,{"$f":"'Step 0 - Configuration'!E5","v":"Sous-national"},{"$f":"IF(C$6=\"\",\"NA\",SUMPRODUCT(($D$11:$D$60=C$6)*(($E$11:$E$60=$B8)+($E$11:$E$60='Step 0 - Configuration'!#REF!))))","v":"NA"},{"$f":"IF(D$6=\"\",\"NA\",SUMPRODUCT(($D$11:$D$60=D$6)*(($E$11:$E$60=$B8)+($E$11:$E$60='Step 0 - Configuration'!#REF!))))","v":"NA"},{"$f":"IF(E$6=\"\",\"NA\",SUMPRODUCT(($D$11:$D$60=E$6)*(($E$11:$E$60=$B8)+($E$11:$E$60='Step 0 - Configuration'!#REF!))))","v":"NA"},{"$f":"IF(F$6=\"\",\"NA\",SUMPRODUCT(($D$11:$D$60=F$6)*(($E$11:$E$60=$B8)+($E$11:$E$60='Step 0 - Configuration'!#REF!))))","v":"NA"},{"$f":"IF(G$6=\"\",\"NA\",SUMPRODUCT(($D$11:$D$60=G$6)*(($E$11:$E$60=$B8)+($E$11:$E$60='Step 0 - Configuration'!#REF!))))","v":"NA"},{"$f":"IF(H$6=\"\",\"NA\",SUMPRODUCT(($D$11:$D$60=H$6)*(($E$11:$E$60=$B8)+($E$11:$E$60='Step 0 - Configuration'!#REF!))))","v":"NA"},{"$f":"IF(I$6=\"\",\"NA\",SUMPRODUCT(($D$11:$D$60=I$6)*(($E$11:$E$60=$B8)+($E$11:$E$60='Step 0 - Configuration'!#REF!))))","v":"NA"},{"$f":"IF(J$6=\"\",\"NA\",SUMPRODUCT(($D$11:$D$60=J$6)*(($E$11:$E$60=$B8)+($E$11:$E$60='Step 0 - Configuration'!#REF!))))","v":"NA"},{"$f":"IF(K$6=\"\",\"NA\",SUMPRODUCT(($D$11:$D$60=K$6)*(($E$11:$E$60=$B8)+($E$11:$E$60='Step 0 - Configuration'!#REF!))))","v":"NA"},{"$f":"IF(L$6=\"\",\"NA\",SUMPRODUCT(($D$11:$D$60=L$6)*(($E$11:$E$60=$B8)+($E$11:$E$60='Step 0 - Configuration'!#REF!))))","v":"NA"}]
[]
[null,"#","Nom d'indicateur","Catégorie","National / Sous-national","Fréquence","Vague","Annuler?"]
[null,{"$f":"IF(C11=\"\",\"\",1)","v":1},"% des enfants de 6–59 mois qui ont une infection palustre (par microscopie)",null,"National"]
[null,{"$f":"IF(OR(B11=\"\",C12=\"\"),\"\",B11+1)","v":2},"% de la population des ménages qui a dormi sous une MILDA la nuit précédente",null,"National"]
[null,{"$f":"IF(OR(B12=\"\",C13=\"\"),\"\",B12+1)","v":3},"Proportion des menages ayant l'acces universel aux MILDA (1 MILDA pour 2 personnes)",null,"National"]
[null,4,"% d’enfants de moins de 5 ans avec une fièvre au cours des 15 dernier jours qui ont subi une piqûre au doigt ou au talon pour le diagnostic du paludisme",null,"National"]
[null,5,"% de personnes qui sont capables de reconnaître au moins un symptome du paludisme",null,"National"]
[null,6,"% de personnes qui sont capables de reconnaître le moyen de transmission du paludisme",null,"National"]
[null,7,"Le taux d'execution des activites planifies dans le plan d'action annuel du PNLP",null,"National"]
[null,8,"Proportion de la contribution du gouvernement dans le financement de la lutte contre le paludisme",null,"National"]
[null,9,"Cas confirmés de paludisme pour 1 000 habitants",null,"Sous-national"]
[null,10,"Décès hospitaliers imputables au paludisme pour 100 000 habitants",null,"Sous-national"]
{"$rows_left_out":101}
{"sheet":"Étape 3 - Définir indicateurs","index":3,"n_rows":120,"n_cols":7,"rows_kept":120,"cut":false,"hidden":false,"merged":[]}
[]
[null,{"$f":"CONCATENATE('Step 0 - Configuration'!C3,\": \",'Step 0 - Configuration'!C6)","v":"NOM DU PAYS: NOM DE LA CARTE DE SCORE"}]
[null,"Étape 3: Définitions des indicateurs"]
[]
[]
[null,"Nom de l'indicateur","Category","National / Subnational","Numérateur","Dénominateur","Source de données"]
[null,null,{"$f":"IF('Étape 2 - Sélection indicateurs'!D11=\"\",\"\",'Étape 2 - Sélection indicateurs'!D11)","v":""},{"$f":"IF('Étape 2 - Sélection indicateurs'!E11=\"\",\"\",'Étape 2 - Sélection indicateurs'!E11)","v":"National"}]
[null,null,{"$f":"IF('Étape 2 - Sélection indicateurs'!D12=\"\",\"\",'Étape 2 - Sélection indicateurs'!D12)","v":""},{"$f":"IF('Étape 2 - Sélection indicateurs'!E12=\"\",\"\",'Étape 2 - Sélection indicateurs'!E12)","v":"National"}]
[null,null,{"$f":"IF('Étape 2 - Sélection indicateurs'!D13=\"\",\"\",'Étape 2 - Sélection indicateurs'!D13)","v":""},{"$f":"IF('Étape 2 - Sélection indicateurs'!E13=\"\",\"\",'Étape 2 - Sélection indicateurs'!E13)","v":"National"}]
[null,null,{"$f":"IF('Étape 2 - Sélection indicateurs'!D14=\"\",\"\",'Étape 2 - Sélection indicateurs'!D14)","v":""},{"$f":"IF('Étape 2 - Sélection indicateurs'!E14=\"\",\"\",'Étape 2 - Sélection indicateurs'!E14)","v":"National"}]
[null,null,{"$f":"IF('Étape 2 - Sélection indicateurs'!D15=\"\",\"\",'Étape 2 - Sélection indicateurs'!D15)","v":""},{"$f":"IF('Étape 2 - Sélection indicateurs'!E15=\"\",\"\",'Étape 2 - Sélection indicateurs'!E15)","v":"National"}]
[null,null,{"$f":"IF('Étape 2 - Sélection indicateurs'!D16=\"\",\"\",'Étape 2 - Sélection indicateurs'!D16)","v":""},{"$f":"IF('Étape 2 - Sélection indicateurs'!E16=\"\",\"\",'Étape 2 - Sélection indicateurs'!E16)","v":"National"}]
[null,null,{"$f":"IF('Étape 2 - Sélection indicateurs'!D17=\"\",\"\",'Étape 2 - Sélection indicateurs'!D17)","v":""},{"$f":"IF('Étape 2 - Sélection indicateurs'!E17=\"\",\"\",'Étape 2 - Sélection indicateurs'!E17)","v":"National"}]
[null,null,{"$f":"IF('Étape 2 - Sélection indicateurs'!D18=\"\",\"\",'Étape 2 - Sélection indicateurs'!D18)","v":""},{"$f":"IF('Étape 2 - Sélection indicateurs'!E18=\"\",\"\",'Étape 2 - Sélection indicateurs'!E18)","v":"National"}]
[null,null,{"$f":"IF('Étape 2 - Sélection indicateurs'!D19=\"\",\"\",'Étape 2 - Sélection indicateurs'!D19)","v":""},{"$f":"IF('Étape 2 - Sélection indicateurs'!E19=\"\",\"\",'Étape 2 - Sélection indicateurs'!E19)","v":"Sous-national"}]
[null,null,{"$f":"IF('Étape 2 - Sélection indicateurs'!D20=\"\",\"\",'Étape 2 - Sélection indicateurs'!D20)","v":""},{"$f":"IF('Étape 2 - Sélection indicateurs'!E20=\"\",\"\",'Étape 2 - Sélection indicateurs'!E20)","v":"Sous-national"}]
[null,null,{"$f":"IF('Étape 2 - Sélection indicateurs'!D21=\"\",\"\",'Étape 2 - Sélection indicateurs'!D21)","v":""},{"$f":"IF('Étape 2 - Sélection indicateurs'!E21=\"\",\"\",'Étape 2 - Sélection indicateurs'!E21)","v":"Sous-national"}]
[null,null,{"$f":"IF('Étape 2 - Sélection indicateurs'!D22=\"\",\"\",'Étape 2 - Sélection indicateurs'!D22)","v":""},{"$f":"IF('Étape 2 - Sélection indicateurs'!E22=\"\",\"\",'Étape 2 - Sélection indicateurs'!E22)","v":"Sous-national"}]
[null,null,{"$f":"IF('Étape 2 - Sélection indicateurs'!D23=\"\",\"\",'Étape 2 - Sélection indicateurs'!D23)","v":""},{"$f":"IF('Étape 2 - Sélection indicateurs'!E23=\"\",\"\",'Étape 2 - Sélection indicateurs'!E23)","v":"Sous-national"}]
[null,null,{"$f":"IF('Étape 2 - Sélection indicateurs'!D24=\"\",\"\",'Étape 2 - Sélection indicateurs'!D24)","v":""},{"$f":"IF('Étape 2 - Sélection indicateurs'!E24=\"\",\"\",'Étape 2 - Sélection indicateurs'!E24)","v":"Sous-national"}]
{"$rows_left_out":101}
{"sheet":"Step 4 - Set Thresholds","index":4,"n_rows":120,"n_cols":7,"rows_kept":120,"cut":false,"hidden":false,"merged":[]}
[]
[null,{"$f":"CONCATENATE('Step 0 - Configuration'!C3,\": \",'Step 0 - Configuration'!C6)","v":"NOM DU PAYS: NOM DE LA CARTE DE SCORE"}]
[null,"Étape 4: Seuils"]
[]
[]
[null,"Nom de l'indicateur","Catégorie","National / Sous-national","Seuil rouge","Seuil jaune ","Seuil vert "]
[null,{"$f":"IF('Étape 2 - Sélection indicateurs'!C11=\"\",\"\",'Étape 2 - Sélection indicateurs'!C11)","v":"% des enfants de 6–59 mois qui ont une infection palustre (par microscopie)"},{"$f":"IF('Étape 2 - Sélection indicateurs'!D11=\"\",\"\",'Étape 2 - Sélection indicateurs'!D11)","v":""},{"$f":"IF('Étape 2 - Sélection indicateurs'!E11=\"\",\"\",'Étape 2 - Sélection indicateurs'!E11)","v":"National"}]
[null,{"$f":"IF('Étape 2 - Sélection indicateurs'!C12=\"\",\"\",'Étape 2 - Sélection indicateurs'!C12)","v":"% de la population des ménages qui a dormi sous une MILDA la nuit précédente"},{"$f":"IF('Étape 2 - Sélection indicateurs'!D12=\"\",\"\",'Étape 2 - Sélection indicateurs'!D12)","v":""},{"$f":"IF('Étape 2 - Sélection indicateurs'!E12=\"\",\"\",'Étape 2 - Sélection indicateurs'!E12)","v":"National"}]
[null,{"$f":"IF('Étape 2 - Sélection indicateurs'!C13=\"\",\"\",'Étape 2 - Sélection indicateurs'!C13)","v":"Proportion des menages ayant l'acces universel aux MILDA (1 MILDA pour 2 personnes)"},{"$f":"IF('Étape 2 - Sélection indicateurs'!D13=\"\",\"\",'Étape 2 - Sélection indicateurs'!D13)","v":""},{"$f":"IF('Étape 2 - Sélection indicateurs'!E13=\"\",\"\",'Étape 2 - Sélection indicateurs'!E13)","v":"National"}]
[null,{"$f":"IF('Étape 2 - Sélection indicateurs'!C14=\"\",\"\",'Étape 2 - Sélection indicateurs'!C14)","v":"% d’enfants de moins de 5 ans avec une fièvre au cours des 15 dernier jours qui ont subi une piqûre au doigt ou au talon pour le diagnostic du paludisme"},{"$f":"IF('Étape 2 - Sélection indicateurs'!D14=\"\",\"\",'Étape 2 - Sélection indicateurs'!D14)","v":""},{"$f":"IF('Étape 2 - Sélection indicateurs'!E14=\"\",\"\",'Étape 2 - Sélection indicateurs'!E14)","v":"National"}]
[null,{"$f":"IF('Étape 2 - Sélection indicateurs'!C15=\"\",\"\",'Étape 2 - Sélection indicateurs'!C15)","v":"% de personnes qui sont capables de reconnaître au moins un symptome du paludisme"},{"$f":"IF('Étape 2 - Sélection indicateurs'!D15=\"\",\"\",'Étape 2 - Sélection indicateurs'!D15)","v":""},{"$f":"IF('Étape 2 - Sélection indicateurs'!E15=\"\",\"\",'Étape 2 - Sélection indicateurs'!E15)","v":"National"}]
[null,{"$f":"IF('Étape 2 - Sélection indicateurs'!C16=\"\",\"\",'Étape 2 - Sélection indicateurs'!C16)","v":"% de personnes qui sont capables de reconnaître le moyen de transmission du paludisme"},{"$f":"IF('Étape 2 - Sélection indicateurs'!D16=\"\",\"\",'Étape 2 - Sélection indicateurs'!D16)","v":""},{"$f":"IF('Étape 2 - Sélection indicateurs'!E16=\"\",\"\",'Étape 2 - Sélection indicateurs'!E16)","v":"National"}]
[null,{"$f":"IF('Étape 2 - Sélection indicateurs'!C17=\"\",\"\",'Étape 2 - Sélection indicateurs'!C17)","v":"Le taux d'execution des activites planifies dans le plan d'action annuel du PNLP"},{"$f":"IF('Étape 2 - Sélection indicateurs'!D17=\"\",\"\",'Étape 2 - Sélection indicateurs'!D17)","v":""},{"$f":"IF('Étape 2 - Sélection indicateurs'!E17=\"\",\"\",'Étape 2 - Sélection indicateurs'!E17)","v":"National"}]
[null,{"$f":"IF('Étape 2 - Sélection indicateurs'!C18=\"\",\"\",'Étape 2 - Sélection indicateurs'!C18)","v":"Proportion de la contribution du gouvernement dans le financement de la lutte contre le paludisme"},{"$f":"IF('Étape 2 - Sélection indicateurs'!D18=\"\",\"\",'Étape 2 - Sélection indicateurs'!D18)","v":""},{"$f":"IF('Étape 2 - Sélection indicateurs'!E18=\"\",\"\",'Étape 2 - Sélection indicateurs'!E18)","v":"National"}]
[null,{"$f":"IF('Étape 2 - Sélection indicateurs'!C19=\"\",\"\",'Étape 2 - Sélection indicateurs'!C19)","v":"Cas confirmés de paludisme pour 1 000 habitants"},{"$f":"IF('Étape 2 - Sélection indicateurs'!D19=\"\",\"\",'Étape 2 - Sélection indicateurs'!D19)","v":""},{"$f":"IF('Étape 2 - Sélection indicateurs'!E19=\"\",\"\",'Étape 2 - Sélection indicateurs'!E19)","v":"Sous-national"}]
[null,{"$f":"IF('Étape 2 - Sélection indicateurs'!C20=\"\",\"\",'Étape 2 - Sélection indicateurs'!C20)","v":"Décès hospitaliers imputables au paludisme pour 100 000 habitants"},{"$f":"IF('Étape 2 - Sélection indicateurs'!D20=\"\",\"\",'Étape 2 - Sélection indicateurs'!D20)","v":""},{"$f":"IF('Étape 2 - Sélection indicateurs'!E20=\"\",\"\",'Étape 2 - Sélection indicateurs'!E20)","v":"Sous-national"}]
[null,{"$f":"IF('Étape 2 - Sélection indicateurs'!C21=\"\",\"\",'Étape 2 - Sélection indicateurs'!C21)","v":"% de menages situees dans zones ciblees par la PID ayant beneficie de la pulvérisations intradomiciliaires à effet rémanent au cours des 12 derniers mois"},{"$f":"IF('Étape 2 - Sélection indicateurs'!D21=\"\",\"\",'Étape 2 - Sélection indicateurs'!D21)","v":""},{"$f":"IF('Étape 2 - Sélection indicateurs'!E21=\"\",\"\",'Étape 2 - Sélection indicateurs'!E21)","v":"Sous-national"}]
[null,{"$f":"IF('Étape 2 - Sélection indicateurs'!C22=\"\",\"\",'Étape 2 - Sélection indicateurs'!C22)","v":"% des femmes enceintes ayant reçu un TPI avec au moins 3 dose de SP lors de CPN"},{"$f":"IF('Étape 2 - Sélection indicateurs'!D22=\"\",\"\",'Étape 2 - Sélection indicateurs'!D22)","v":""},{"$f":"IF('Étape 2 - Sélection indicateurs'!E22=\"\",\"\",'Étape 2 - Sélection indicateurs'!E22)","v":"Sous-national"}]
[null,{"$f":"IF('Étape 2 - Sélection indicateurs'!C23=\"\",\"\",'Étape 2 - Sélection indicateurs'!C23)","v":"Proportion d’enfants ayant reçu une MILDA lors des CPS"},{"$f":"IF('Étape 2 - Sélection indicateurs'!D23=\"\",\"\",'Étape 2 - Sélection indicateurs'!D23)","v":""},{"$f":"IF('Étape 2 - Sélection indicateurs'!E23=\"\",\"\",'Étape 2 - Sélection indicateurs'!E23)","v":"Sous-national"}]
[null,{"$f":"IF('Étape 2 - Sélection indicateurs'!C24=\"\",\"\",'Étape 2 - Sélection indicateurs'!C24)","v":"Proportion des femmes enceintes ayant reçu une MILDA lors des CPN"},{"$f":"IF('Étape 2 - Sélection indicateurs'!D24=\"\",\"\",'Étape 2 - Sélection indicateurs'!D24)","v":""},{"$f":"IF('Étape 2 - Sélection indicateurs'!E24=\"\",\"\",'Étape 2 - Sélection indicateurs'!E24)","v":"Sous-national"}]
{"$rows_left_out":101}
{"sheet":"Output - Draft Scorecard","index":5,"n_rows":30,"n_cols":23,"rows_kept":30,"cut":false,"hidden":false,"merged":[]}
[]
[null,{"$f":"CONCATENATE('Step 0 - Configuration'!C3,\": \",'Step 0 - Configuration'!C6)","v":"NOM DU PAYS: NOM DE LA CARTE DE SCORE"},null,null,null,null,null,null,null,null,"<-- Only click when indicators have been completed"]
[null,"Résultat: Draft carte de score"]
[]
[null,{"$f":"CONCATENATE('Step 0 - Configuration'!E4,\" Indicators\")","v":"National Indicators"}]
[]
[]
[null,"National / Subnational","National"]
[]
[null,"Category","Indicator Name"]
[null,"Maternal Health"]
[null,"Teenage Family Planning Strategy"]
[null,{"$f":"IF(B12=\"\",\"\",\"X%\")","v":"X%"},"","","","","","","","","","","","","","","","","","","","",""]
[]
[null,{"$f":"CONCATENATE('Step 0 - Configuration'!E5,\" Indicators\")","v":"Sous-national Indicators"}]
[]
[]
[null,null,"National / Subnational","Subnational"]
[]
[null,null,"Category","Indicator Name"]
{"$rows_left_out":10}